DATABASE,MUT_TYPE,PROTEIN,SOURCE,LENGTH,MOL-WEIGHT,PIR_ID,SWISSPROT_ID,UNIPROT,PDB_wild,PDB_mutant,PDBs_template,MUTATION,MUTATED_CHAIN,TEMP,pH,MEASURE,METHOD,ddG_H2O,ddG,dTm,REFERENCE,YEAR,PMID,ddg_dynamut2,ddg_maestro,ddg_foldx
Protherm,double,Tumor suppressor P53,Human,386,42986.75,DNHU53,P53_HUMAN (P04637),P04637,1SAK,,,"F341L,L344F",-,25.00,7.00,CD,GdnHCl,,-8.40,,"PROC NATL ACAD SCI U S A   96,     3595-3599 (1999) ",1999,10097082,-1.63,0.22,-0.13
Protherm,double,Tumor suppressor P53,Human,386,43040.74,DNHU53,P53_HUMAN (P04637),P04637,1SAK,,,"I332V,F341L",-,25.00,7.00,CD,GdnHCl,,-2.20,,"PROC NATL ACAD SCI U S A   96,     3595-3599 (1999) ",1999,10097082,-1.96,-0.77,3.45
Protherm,multiple,Tumor suppressor P53,Human,386,43024.77,DNHU53,P53_HUMAN (P04637),P04637,1SAK,,,"I332V,M340I,F341L",-,25.00,7.00,CD,GdnHCl,,-3.10,,"PROC NATL ACAD SCI U S A   96,     3595-3599 (1999) ",1999,10097082,-1.41,-0.41,4.29
Protherm,double,Tumor suppressor P53,Human,386,42986.75,DNHU53,P53_HUMAN (P04637),P04637,1SAK,,,"F341L,L344I",-,25.00,7.00,CD,GdnHCl,,-1.30,,"PROC NATL ACAD SCI U S A   96,     3595-3599 (1999) ",1999,10097082,-1.81,-0.46,1.36
Protherm,multiple,Tumor suppressor P53,Human,386,43040.74,DNHU53,P53_HUMAN (P04637),P04637,1SAK,,,"I332V,F341L,L344I",-,25.00,7.00,CD,GdnHCl,,-0.10,,"PROC NATL ACAD SCI U S A   96,     3595-3599 (1999) ",1999,10097082,-1.60,-0.26,3.47
Protherm,double,P53 DNA binding domain,Human,386,43121.86,DNHU53,P53_HUMAN (P04637),P04637,2AC0,,,"C124W,M133L",A,10.00,7.20,Fluorescence,Urea,,-1.30,1.80,"J MOL BIOL  393,    161-175 (2009)  ",2009,19683006,-3.45,-0.04,6.62
Protherm,double,P53 DNA binding domain,Human,386,43006.73,DNHU53,P53_HUMAN (P04637),P04637,2AC0,,,"L145I,V157I",A,10.00,7.20,Fluorescence,Urea,,-1.20,1.50,"J MOL BIOL  393,    161-175 (2009)  ",2009,19683006,-2.01,-0.13,-0.05
Protherm,double,P53 DNA binding domain,Human,386,42992.70,DNHU53,P53_HUMAN (P04637),P04637,2AC0,,,"L145V,V157L",A,10.00,7.20,Fluorescence,Urea,,0.80,-1.10,"J MOL BIOL  393,    161-175 (2009)  ",2009,19683006,-1.64,-0.05,1.46
Protherm,double,Lysozyme,Bacteriophage T4,164,18740.09,LZBPT4,LYS_BPT4 (P00720),P00720,2LZM,1L89,,"L99A,F153A",-,64.88,5.70,CD,Thermal,,-6.90,-22.80,"J MOL BIOL  229,       747-769 (1993) ",1993,8433369,-7.85,0.72,7.76
Protherm,double,Barnase,Bacillus amyloliquefaciens,123,13996.25,NRBSN,RNBR_BACAM (P00648),P00648,1BNI,,,"H18R,W94L",A,25.00,6.30,Fluorescence,Urea,-1.60,-2.13,,"J MOL BIOL  227,       544-559 (1992) ",1992,1404368,-1.84,-0.31,-0.41
Protherm,double,Barnase,Bacillus amyloliquefaciens,123,13836.98,NRBSN,RNBR_BACAM (P00648),P00648,1BNI,,,"R69S,D93N",A,25.00,6.30,Fluorescence,Urea,,-3.49,,"BIOCHEMISTRY   35,     6786-6794 (1996) ",1996,8639630,-1.87,-0.06,0.67
Protherm,double,Cold shock protein,Bacillus caldolyticus,66,7491.16,I40158,CSPB_BACCL (P41016),P41016,1C9O,,,"G23Q,S24D",A,70.00,7.00,CD,Thermal,,-0.12,-1.00,J MOL BIOL 313    343-357 (2001)          ,2001,11800561,0.23,-0.00,0.38
Protherm,multiple,CspA,Escherichia coli,70,7516.16,OCECJ,CSPA_ECOLI (P0A9X9),P0A9X9,1MJC,,,"F18L,F20L,F31L",-,25.00,7.00,CD,Urea,-0.88,-0.88,,"FOLD DES       3,         87-93 (1998) ",1998,9565753,-1.44,-0.29,1.81
Protherm,double,Barnase,Bacillus amyloliquefaciens,123,13940.15,NRBSN,RNBR_BACAM (P00648),P00648,1BNI,,,"T16S,Y17A",A,25.00,6.30,Fluorescence,Urea,,2.39,,"J MOL BIOL  219,           5-9 (1991) ",1991,2023260,1.16,-0.25,1.15
Protherm,double,Staphylococcal nuclease,Staphylococcus aureus,231,25542.08,NCSAF,NUC_STAAU (P00644),P00644,1STN,,,"V66L,G88V",-,20.00,7.00,Fluorescence,GdnHCl,-2.10,-2.10,,"PROTEINS       1,         81-89 (1986) ",1986,3449854,-0.47,-0.44,-1.09
Protherm,double,Protein G,Streptococcus,448,47656.04,A24496,SPG1_STRSP (P06654),P06654,1PGA,,,"I6T,T53I",A,63.00,5.20,CD,Thermal,,1.59,,"STRUCTURE FOLD DES    7,   1333-1343 (1999)  ",1999,10574793,1.58,0.04,-0.27
Protherm,double,Cellular prion protein,Mouse,232,25607.06,A23544,PRIO_MOUSE (P04925),P04925,1AG2,,,"D178N,M129N",-,25.00,7.00,CD,Urea,,1.72,,"BIOCHEMISTRY   38,     3258-3267 (1999) ",1999,10079068,-1.80,-0.00,1.80
Protherm,double,Prolactin,Human,199,22968.98,LCHU,PRL_HUMAN (P01236),P01236,2Q98,,,"H30A,H173A",A,25.00,5.80,Fluorescence,Urea,,3.70,,"PROTEIN SCI   18,    909-920 (2009)  ",2009,19384991,1.23,-0.15,-1.72
Protherm,double,Gene V,Bacteriophage f1,87,9805.17,DDBPF1,G5P_BPFD (P69542),P69542,1VQB,,,"I6V,M77V",-,25.00,7.00,CD,GdnHCl,,-0.04,,"PROC NATL ACAD SCI U S A   90,     8367-8371 (1993) ",1993,8378307,-0.25,0.05,0.92
Protherm,double,Staphylococcal nuclease,Staphylococcus aureus,231,25598.19,NCSAF,NUC_STAAU (P00644),P00644,1STN,,,"V66I,I72L",-,20.00,7.00,Fluorescence,GdnHCl,,-1.70,,BIOCHEMISTRY 40  14004-14011 (2001)     ,2001,11705392,-1.12,-0.08,-1.06
Protherm,multiple,Prolactin,Human,199,22968.98,LCHU,PRL_HUMAN (P01236),P01236,2Q98,,,"H30A,H173A,H180A",A,25.00,5.80,Fluorescence,Urea,,3.98,,"PROTEIN SCI   18,    909-920 (2009)  ",2009,19384991,0.80,-0.28,-1.53
Protherm,double,Iso-1 cytochrome c,Saccharomyces cerevisiae,109,12242.12,CCBY,CYC1_YEAST (P00044),P00044,1YCC,,,"N52A,C102A",-,46.50,6.00,Abs,Thermal,,3.90,15.60,"J BIOL CHEM  266,   11686-11694 (1991) ",1991,1646814,2.02,-0.04,1.07
Protherm,double,Lysozyme,Bacteriophage T4,164,18761.17,LZBPT4,LYS_BPT4 (P00720),P00720,2LZM,,,"T115A,R119A",-,51.65,3.01,CD,Thermal,,-0.17,-0.52,"J MOL BIOL  246,       317-330 (1995) ",1995,7869383,-0.29,-0.08,0.35
Protherm,multiple,Staphylococcal nuclease,Staphylococcus aureus,231,25570.13,NCSAF,NUC_STAAU (P00644),P00644,1STN,,,"I72V,I92V,V99L",-,20.00,7.00,Fluorescence,GdnHCl,,-2.00,,BIOCHEMISTRY 40  14012-14019 (2001)     ,2001,11705393,-1.28,-0.01,1.13
Protherm,double,Lysozyme,Bacteriophage T4,164,18778.18,LZBPT4,LYS_BPT4 (P00720),P00720,2LZM,,,"N144E,K147M",-,65.40,5.50,CD,Thermal,,0.50,1.20,"BIOCHEMISTRY   30,     7142-7153 (1991) ",1991,1854726,0.24,-0.27,-2.18
Protherm,double,Chemotactic protein,Escherichia coli,129,14214.15,QRECCY,CHEY_ECOLI (P0AE67),P0AE67,1CEY,,,"T112A,F14N",-,25.00,8.00,CD,Urea,,1.40,,"PROTEINS   22,       340-349 (1995) ",1995,7479708,1.76,-0.10,2.46
Protherm,double,High mobility group protein,Rat,215,25032.13,NSRTH1,HMG1_RAT (P63159),P63159,1HME,,,"N51H,D56H",_,20.00,7.00,CD,Thermal,,0.36,6.20,"PROTEIN ENG   15,    817-825 (2002)  ",2002,12468716,-0.23,0.46,0.54
Protherm,double,Acidic fibroblast growth factor,Human,155,17623.17,A33665,FGF1_HUMAN (P05230),P05230,2AFG,,,"H21Y,H102Y",A,39.80,7.30,Fluorescence,Thermal,,1.05,5.00,"PROTEIN ENG DES SEL   17,    603-611 (2004)  ",2004,15469994,0.52,-0.64,-2.23
Protherm,double,Barnase,Bacillus amyloliquefaciens,123,13862.08,NRBSN,RNBR_BACAM (P00648),P00648,1BNI,,,"Y13A,Y17A",A,25.00,6.30,Fluorescence,Urea,-3.96,-4.18,,"J MOL BIOL  224,       783-804 (1992) ",1992,1569557,1.27,-0.07,1.58
Protherm,double,Lambda repressor,Bacteriophage lambda,237,26283.08,RPBPL,RPC1_LAMBD (P03034),P03034,1LRP,,,"G46A,G48A",-,53.40,8.00,DSC,Thermal,,1.10,6.20,"PROTEINS       1,         43-46 (1986) ",1986,3449850,1.48,-0.19,3.12
Protherm,double,Gene V,Bacteriophage f1,87,9815.19,DDBPF1,G5P_BPFD (P69542),P69542,1VQB,,,"V35L,I47M",-,25.00,7.00,CD,GdnHCl,-2.60,-5.30,,"PROC NATL ACAD SCI U S A   88,     1706-1710 (1991) ",1991,2000379,-4.57,0.18,-0.72
Protherm,double,Carbonic anhydrase II,Human,260,29206.97,CRHU2,CAH2_HUMAN (P00918),P00918,1CAH,,,"W5F,W16F",-,23.00,7.50,Fluorescence,GdnHCl,0.40,-5.00,,"BIOCHEMISTRY   34,     2153-2162 (1995) ",1995,7857926,-3.50,-0.04,12.17
Protherm,double,Staphylococcal nuclease,Staphylococcus aureus,231,25556.10,NCSAF,NUC_STAAU (P00644),P00644,1STN,,,"I72V,V99L",-,20.00,7.00,Fluorescence,GdnHCl,,-1.70,,BIOCHEMISTRY 40  14004-14011 (2001)     ,2001,11705392,-0.95,-0.10,-0.37
Protherm,double,Rop,Escherichia coli,63,7299.08,RGECRE,ROP_ECOLI (P03051),P03051,1ROP,,,"C38A,C52A",A,70.00,6.30,CD,Urea,,-8.30,-14.00,"PROTEIN SCI   19,    670-679 (2010)  ",2010,20095056,-1.66,0.03,-0.11
Protherm,double,Flavodoxin,Anabaena,170,19045.11,S04600,FLAV_ANASP (P0A3D9),P0A3D9,1FLV,,,"H34A,F7L",-,25.00,8.50,Fluorescence,Urea,,1.64,,"J MOL BIOL  290,       319-330 (1999) ",1999,10388575,-0.14,-0.20,2.92
Protherm,double,Lysozyme,Human,148,16608.08,LZHU,LYSC_HUMAN (P61626),P61626,1LZ1,1LHM,,"C77A,C95A",-,57.00,3.00,DSC,Thermal,,-4.60,-14.50,"BIOCHEMISTRY   31,     8323-8328 (1992) ",1992,1525170,-5.33,0.05,3.87
Protherm,multiple,Cold shock protein B,Bacillus subtilis,67,7463.16,A45723,CSPB_BACSU (P32081),P32081,1CSP,,,"E3R,A46K,S48R",_,70.00,7.00,CD,Thermal,,3.37,20.70,"J MOL BIOL  347,   1063-1076 (2005)  ",2005,15784264,2.00,-0.13,0.03
Protherm,double,GCN4-p1,Saccharomyces cerevisiae,281,31437.19,RGBYA2,GCN4_YEAST (P03069),P03069,2ZTA,,,"E22Q,K27A",A,15.00,7.00,CD,Urea,,-2.80,,"J MOL BIOL  336,    989-996 (2004)  ",2004,15037063,-0.19,-0.31,0.09
Protherm,double,Ubiquitin,Saccharomyces cerevisiae,121,13773.81,A29456,UBIQ_YEAST (P39940),P39940,1OTR,,,"I30V,I36F",B,50.00,3.00,DSC,Thermal,,-2.48,-19.80,"BIOCHEMISTRY   39,  10275-10283 (2000) ",2000,10956017,-1.33,0.30,1.34
Protherm,double,Ribonuclease HI,Escherichia coli,155,17753.19,NRECH,RNH_ECOLI (P0A7Y4),P0A7Y4,2RN2,,,"K91R,K95G",-,49.80,5.50,CD,Thermal,,1.60,5.80,"J BIOL CHEM  267,   22014-22017 (1992) ",1992,1331044,1.14,-0.07,-1.62
Protherm,multiple,Ribonuclease HI,Escherichia coli,155,17658.07,NRECH,RNH_ECOLI (P0A7Y4),P0A7Y4,2RN2,,,"H62P,T40A,K122R",-,50.10,3.00,CD,Thermal,,-0.50,1.70,"J BIOL CHEM  269,   26904-26911 (1994) ",1994,7929430,0.83,-0.17,-0.76
Protherm,double,Protein G,Streptococcus,448,47654.07,A24496,SPG1_STRSP (P06654),P06654,1PGA,,,"I6V,T53V",A,63.00,5.20,CD,Thermal,,2.99,,"STRUCTURE FOLD DES    7,   1333-1343 (1999)  ",1999,10574793,2.39,-0.35,-0.53
Protherm,multiple,Protein G,Streptococcus,448,47680.16,A24496,SPG1_STRSP (P06654),P06654,1PGA,,,"T16L,T18V,V29F",_,49.30,7.00,CD,Thermal,,2.48,17.70,"J MOL BIOL  351,   1160-1168 (2005)  ",2005,16051264,1.15,-0.70,-2.35
Protherm,double,Ketosteroid isomerase,Pseudomonas putida,131,14894.37,SIPSDP,SDIS_PSEPU (P07445),P07445,1OH0,,,"Y57F,V101L",A,25.00,7.00,CD,Urea,,-7.90,,"BIOCHEMISTRY   39,   4581-4589 (2000) ",2000,10769113,-2.20,0.06,1.59
Protherm,double,Spectrin,Chicken,2477,285425.05,SJCHA,SPCA_CHICK (P07751),P07751,1AJ3,,,"W22Y,S74L",-,25.00,7.50,Fluorescence,Urea,,-0.23,,"J BIOL CHEM  272,   21052-21059 (1997) ",1997,9261107,-0.69,0.03,-0.43
Protherm,double,Protein G,Streptococcus,448,47626.02,A24496,SPG1_STRSP (P06654),P06654,1PGA,,,"I6A,T53R",A,25.00,7.20,CD,Thermal,,0.84,,"STRUCTURE FOLD DES    7,   1333-1343 (1999)  ",1999,10574793,1.02,0.42,1.47
Protherm,double,Ubiquitin,Saccharomyces cerevisiae,121,13787.84,A29456,UBIQ_YEAST (P39940),P39940,1OTR,,,"I30L,I36L",B,50.00,3.00,DSC,Thermal,,-1.93,-15.40,"BIOCHEMISTRY   39,  10275-10283 (2000) ",2000,10956017,-1.59,-0.15,-0.13
Protherm,double,Gene V,Bacteriophage f1,87,9833.23,DDBPF1,G5P_BPFD (P69542),P69542,1VQB,,,"V35M,I47L",-,25.00,7.00,CD,GdnHCl,,-1.70,,"PROC NATL ACAD SCI U S A   90,     8367-8371 (1993) ",1993,8378307,-2.72,0.13,-1.16
Protherm,double,Staphylococcal nuclease,Staphylococcus aureus,231,25584.16,NCSAF,NUC_STAAU (P00644),P00644,1STN,,,"V23L,V66L",-,20.00,7.00,Fluorescence,GdnHCl,,-1.10,,BIOCHEMISTRY 40  14004-14011 (2001)     ,2001,11705392,-1.16,-0.24,-2.98
Protherm,double,Lysozyme,Bacteriophage T4,164,18708.00,LZBPT4,LYS_BPT4 (P00720),P00720,2LZM,1QUH,,"L99G,E108V",-,65.20,5.40,CD,Thermal,,-5.60,-16.30,"J MOL BIOL  292,     1111-1120 (1999) ",1999,10512706,-4.79,0.46,5.35
Protherm,double,Ribose-binding protein,Escherichia coli,271,28571.25,JGECR,RBSB_ECOLI (P02925),P02925,2DRI,,,"S9A,I132A",_,57.50,7.00,CD,Thermal,,-1.60,-0.70,"PROTEIN SCI   16,    362-368 (2007)  ",2007,17242374,-3.26,0.13,0.67
Protherm,double,Fyn tyrosine kinase,Human,537,61044.28,TVHUSY,FYN_HUMAN (P06241),P06241,1SHF,,,"E107A, S124R",A,25.00,8.00,CD,GdnHCl,,-1.65,,"J MOL BIOL  320,    389-402 (2002)  ",2002,12079394,-0.52,-0.33,-3.24
Protherm,double,Alpha spectrin (SH3 domain),Chicken,2477,285524.17,SJCHA,SPCN_CHICK (P07751),P07751,1SHG,,,"K18Y,K59F",-,24.85,7.00,Fluorescence,Urea,,-2.39,,"PROC NATL ACAD SCI U S A   99,   5349-5354 (2002)  ",2002,11959988,-1.18,0.28,0.53
Protherm,double,HPr protein,Bacillus subtilis,88,9388.21,WQBSPH,PTHP_BACSU (P08877),P08877,2HPR,,,"A2R,N71E",_,25.00,7.00,CD,Thermal,,1.60,10.10,"BIOCHEMISTRY   45,   4084-4092 (2006)  ",2006,16566582,1.25,-0.09,-1.12
Protherm,multiple,Staphylococcal nuclease,Staphylococcus aureus,231,25570.13,NCSAF,NUC_STAAU (P00644),P00644,1STN,,,"L25I,V66L,I72V",-,20.00,7.00,Fluorescence,GdnHCl,,-2.20,,BIOCHEMISTRY 40  14012-14019 (2001)     ,2001,11705393,-2.58,-0.18,2.87
Protherm,multiple,Acidic fibroblast growth factor,Human,155,17623.17,A33665,FGF1_HUMAN (P05230),P05230,2AFG,,,"H21Y,H102Y,F108Y",A,40.70,7.30,CD,Thermal,,0.81,3.80,"PROTEIN ENG DES SEL   17,    603-611 (2004)  ",2004,15469994,0.66,-0.46,-1.73
Protherm,multiple,Protein G,Streptococcus,448,47680.16,A24496,SPG1_STRSP (P06654),P06654,1PGA,,,"T16I,T18I,V29W",_,30.00,8.50,Fluorescence,GdnHCl,,2.63,,"J MOL BIOL  351,   1160-1168 (2005)  ",2005,16051264,2.08,-0.87,-1.71
Protherm,double,Suc1,Schizosaccharomyces pombe,113,13503.05,A26722,CKS1_SCHPO (P08463),P08463,1SCE,,,"P90G,P92G",A,25.00,7.50,Fluorescence,Urea,,-0.88,,"J MOL BIOL  301,    199-204 (2000) ",2000,10926502,-2.00,-0.07,4.57
Protherm,multiple,Im9,Escherichia coli,86,9724.14,A32535,IMM9_ECOLI (P13479),P13479,1IMQ,,,"V37L,E41V,V71I",_,10.00,7.00,Fluorescence,Urea,,1.05,,"J MOL BIOL  342,    261-273 (2004)  ",2004,15313622,0.61,-0.34,3.35
Protherm,double,Myoglobin,Sperm whale,153,17285.11,MYWHP,MYG_PHYCA (P02185),P02185,1BVC,,,"V66A,L135A",-,82.20,9.60,CD,Thermal,,4.79,-11.00,"PROTEIN SCI    3,   1430-1435 (1994) ",1994,7833805,-0.73,0.30,3.88
Protherm,multiple,Acidic fibroblast growth factor,Human,155,17599.19,A33665,FGF1_HUMAN (P05230),P05230,2AFG,,,"H21Y,L44F,H102Y",A,40.70,7.30,CD,Thermal,,0.98,4.60,"PROTEIN ENG DES SEL   17,    603-611 (2004)  ",2004,15469994,0.41,-0.33,-0.07
Protherm,multiple,Staphylococcal nuclease,Staphylococcus aureus,231,25598.19,NCSAF,NUC_STAAU (P00644),P00644,1STN,,,"V23L,L25I,I72L",-,20.00,7.00,Fluorescence,GdnHCl,,-1.40,,BIOCHEMISTRY 40  14012-14019 (2001)     ,2001,11705393,-1.80,-0.06,1.13
Protherm,multiple,Lysozyme,Bacteriophage T4,164,18764.11,LZBPT4,LYS_BPT4 (P00720),P00720,2LZM,,,"K16E,K135E,K147E",-,66.70,5.30,CD,Thermal,,-1.70,-4.00,"J MOL BIOL  221,       873-887 (1991) ",1991,1942034,-0.34,0.06,0.91
Protherm,double,Lysozyme,Bacteriophage T4,164,18736.10,LZBPT4,LYS_BPT4 (P00720),P00720,2LZM,1L63,,"C54T,C97A",-,65.40,5.50,CD,Thermal,,0.00,0.00,"BIOCHEMISTRY   30,     7142-7153 (1991) ",1991,1854726,-0.63,0.03,-0.54
Protherm,double,Lysozyme,Bacteriophage T4,164,18796.20,LZBPT4,LYS_BPT4 (P00720),P00720,2LZM,,,"V111I,F153L",-,51.76,3.01,CD,Thermal,,-1.09,-3.52,"J MOL BIOL  224,     1143-1159 (1992) ",1992,1569571,-0.84,-0.34,2.14
Protherm,double,Staphylococcal nuclease,Staphylococcus aureus,231,25598.19,NCSAF,NUC_STAAU (P00644),P00644,1STN,,,"V66L,I92V",-,20.00,7.00,Fluorescence,GdnHCl,,0.10,,BIOCHEMISTRY 40  14004-14011 (2001)     ,2001,11705392,-1.12,-0.11,-0.45
Protherm,double,Trypsin inhibitor,Bovine,80,8888.95,TIBO,BPT1_BOVIN (P00974),P00974,1BPI,,,"C30T,C51A",-,25.00,7.80,Abs,GdnHCl,,-2.00,,"BIOCHEMISTRY   29,     4410-4419 (1990) ",1990,1693524,-6.90,0.30,4.50
Protherm,double,Ribosomal protein L9,Bacillus stearothermophilus,149,16391.13,R5BS7F,RL9_BACST (P02417),P02417,1DIV,,,"F5V,K12M",_,25.00,5.50,CD,Urea,,-2.44,,"BIOCHEMISTRY   45,  10110-10116 (2006)  ",2006,16906769,-2.03,-0.05,1.93
Protherm,double,Lysozyme,Bacteriophage T4,164,18715.05,LZBPT4,LYS_BPT4 (P00720),P00720,2LZM,1L41,,"K83H,A112D",-,64.60,6.50,CD,Thermal,,-1.50,-3.90,"BIOCHEMISTRY   30,     7142-7153 (1991) ",1991,1854726,-1.18,0.23,3.72
Protherm,multiple,Ribonuclease Sa,Streptomyces aureofaciens,96,10705.17,NRSM,RNSA_STRAU (P05798),P05798,1RGG,,,"D1K,D17K,E41K",A,25.00,7.00,CD,Urea,,-2.70,,"PROTEIN SCI   19,    929-943 (2010)  ",2010,20198681,0.67,-0.33,-1.42
Protherm,double,Staphylococcal nuclease,Staphylococcus aureus,231,25570.13,NCSAF,NUC_STAAU (P00644),P00644,1STN,,,"I92L,V99L",-,20.00,7.00,Fluorescence,GdnHCl,,-1.30,,BIOCHEMISTRY 40  14004-14011 (2001)     ,2001,11705392,-1.10,-0.17,-1.39
Protherm,multiple,Lambda repressor,Bacteriophage lambda,237,26391.24,RPBPL,RPC1_LAMBD (P03034),P03034,1LRP,,,"V36F,M40F,V47F",-,25.00,7.00,CD,GdnHCl,,-3.10,,"BIOCHEMISTRY   31,     4324-4333 (1992) ",1992,1567879,-2.16,0.22,2.07
Protherm,double,Staphylococcal nuclease,Staphylococcus aureus,231,25584.16,NCSAF,NUC_STAAU (P00644),P00644,1STN,,,"V66L,V99I",-,20.00,7.00,Fluorescence,GdnHCl,,-0.60,,BIOCHEMISTRY 40  14004-14011 (2001)     ,2001,11705392,-0.62,-0.31,-1.77
Protherm,double,Ribonuclease T1,Aspergillus oryzae,125,13528.46,NRAST1,RNT1_ASPOR (P00651),P00651,1RN1,,,"Y42W,W59Y",B,25.00,6.00,DSC,Thermal,,-1.03,-3.50,"EUR J BIOCHEM  220,    527-534 (1994) ",1994,8125111,-0.97,-0.07,5.30
Protherm,double,Acidic fibroblast growth factor,Human,155,17547.08,A33665,FGF1_HUMAN (P05230),P05230,2AFG,,,"C83S,C117S",-,24.85,6.60,DSC,Thermal,,-1.82,-13.50,"BIOCHEMISTRY   39,   7153-7158 (2000) ",2000,10852713,-1.70,1.15,1.45
Protherm,double,Chymotrypsin inhibitor,Barley,84,9452.08,EIBH2A,ICI2_HORVU (P01053),P01053,2CI2,,,"V57A,V79A",I,25.00,6.25,Fluorescence,GdnHCl,-3.78,-4.37,,"J MOL BIOL  254,       260-288 (1995) ",1995,7490748,-2.13,0.28,1.38
Protherm,double,Lambda repressor,Bacteriophage lambda,237,26391.24,RPBPL,RPC1_LAMBD (P03034),P03034,1LRP,,,"V36F,M40L",-,25.00,7.00,CD,GdnHCl,,-1.40,,"BIOCHEMISTRY   31,     4324-4333 (1992) ",1992,1567879,-1.28,-0.07,1.03
Protherm,double,Tryptophan synthase alpha-subunit,Salmonella typhimurium,268,28811.21,TSEBAT,TRPA_SALTY (P00929),P00929,2WSY,,,"A18V,I232V",A,25.00,7.80,CD,Urea,,-1.30,,"BIOCHEMISTRY   32,     5566-5575 (1993) ",1993,8504078,-1.38,-0.09,0.67
Protherm,multiple,Ribonuclease HI,Escherichia coli,155,17740.11,NRECH,RNH_ECOLI (P0A7Y4),P0A7Y4,2RN2,,,"K91R,D94E,K95G",-,49.80,3.00,CD,Thermal,,1.20,,"J BIOL CHEM  267,   21535-21542 (1992) ",1992,1328237,1.27,-0.09,-0.60
Protherm,double,Immunoglobulin light chain,Human,108,12051.14,K1HURE,KV10_HUMAN (P01607),P01607,1LVE,,,"Q38N,Y27DD",-,25.00,7.50,Fluorescence,GdnHCl,,-1.90,,"PROTEIN SCI   11,   1687-1694 (2002)  ",2002,12070321,-0.87,-0.13,-0.60
Protherm,double,Apolipoprotein A-I,Human,249,29032.26,LPHUA1,APA1_HUMAN (P02647),P02647,1AV1,,,"R116V,K118A",A,25.00,7.40,CD,GdnHCl,,-0.25,-0.50,"BIOCHEMISTRY   45,   1242-1254 (2006)  ",2006,16430220,-0.49,0.41,2.20
Protherm,double,Barnase,Bacillus amyloliquefaciens,123,13944.20,NRBSN,RNBR_BACAM (P00648),P00648,1BNI,,,"S85C,H102C",A,37.00,7.60,Hydrogen exchange,GdnHCl,,4.60,,"J MOL BIOL  333,    169-186 (2003)  ",2003,14516751,4.09,-0.01,-0.02
Protherm,double,Iso-1 cytochrome c,Saccharomyces cerevisiae,109,12255.12,CCBY,CYC1_YEAST (P00044),P00044,1YCC,,,"T96A,C102T",-,57.10,6.00,DSC,Thermal,,1.00,4.00,"BIOCHIM BIOPHYS ACTA 1432,     40-48 (1999)  ",1999,10366726,0.89,0.12,-0.98
Protherm,double,Ribonuclease T1,Aspergillus oryzae,125,13528.46,NRAST1,RNT1_ASPOR (P00651),P00651,1RN1,,,"Y24W,W59Y",B,25.00,6.00,DSC,Thermal,,0.29,-0.60,"EUR J BIOCHEM  220,    527-534 (1994) ",1994,8125111,-0.85,-0.09,0.90
Protherm,double,HPr protein,Bacillus subtilis,88,9360.19,WQBSPH,PTHP_BACSU (P08877),P08877,2HPR,,,"A2K,N71E",_,25.00,7.00,CD,Urea,,1.10,,"BIOCHEMISTRY   45,   4084-4092 (2006)  ",2006,16566582,0.97,-0.05,-1.06
Protherm,multiple,Cold shock protein,Bacillus caldolyticus,66,7448.13,I40158,CSPB_BACCL (P41016),P41016,1C9O,,,"V64T,L66E,L66A",A,25.00,7.00,CD,GdnHCl,,-1.50,,J MOL BIOL 313    343-357 (2001)          ,2001,11800561,-1.39,0.26,2.06
Protherm,double,Ribonuclease Sa,Streptomyces aureofaciens,96,10719.19,NRSM,RNSA_STRAU (P05798),P05798,1RGG,,,"D25K,E74K",A,25.00,7.00,CD,GdnHCl,,-0.20,,"PROTEIN SCI   19,   1044-1052 (2010)  ",2010,20340133,0.79,-0.21,-2.53
Protherm,double,Gene V,Bacteriophage f1,87,9805.17,DDBPF1,G5P_BPFD (P69542),P69542,1VQB,,,"V35C,I47C",-,25.00,7.00,CD,GdnHCl,-4.70,-7.10,,"PROC NATL ACAD SCI U S A   88,     1706-1710 (1991) ",1991,2000379,-5.34,0.27,4.65
Protherm,multiple,Chymotrypsin inhibitor,Barley,84,9494.11,EIBH2A,ICI2_HORVU (P01053),P01053,2CI2,1YPA,,"S31A,E33A,E34A",I,25.00,6.25,Fluorescence,GdnHCl,-0.75,-1.67,,"J MOL BIOL  254,       260-288 (1995) ",1995,7490748,-1.44,0.55,3.38
Protherm,double,Cold shock protein,Bacillus caldolyticus,66,7334.97,I40158,CSPB_BACCL (P41016),P41016,1C9O,,,"E46A,L66E",A,25.00,7.00,CD,GdnHCl,,-0.84,,J MOL BIOL 313    343-357 (2001)          ,2001,11800561,-1.58,0.05,1.08
Protherm,double,CspA,Escherichia coli,70,7490.08,OCECJ,CSPA_ECOLI (P0A9X9),P0A9X9,1MJC,,,"F20S,F31S",-,10.00,7.00,CD,Urea,-0.96,-0.96,,"FOLD DES       3,         87-93 (1998) ",1998,9565753,-0.60,0.83,5.31
Protherm,double,Chemotactic protein,Escherichia coli,129,14258.20,QRECCY,CHEY_ECOLI (P0AE67),P0AE67,1CEY,,,"G76A,F14N",-,25.00,8.00,CD,Urea,,3.40,,"PROTEINS   22,       340-349 (1995) ",1995,7479708,1.61,-0.07,3.28
Protherm,double,Protein G,Streptococcus,448,47684.05,A24496,SPG1_STRSP (P06654),P06654,1PGA,,,"I6E,T53E",A,25.00,7.20,CD,Thermal,,-0.59,,"STRUCTURE FOLD DES    7,   1333-1343 (1999)  ",1999,10574793,-0.10,1.00,1.79
Protherm,double,Protein G,Streptococcus,448,47626.02,A24496,SPG1_STRSP (P06654),P06654,1PGA,,,"I6A,T53A",A,46.00,7.20,CD,Thermal,,0.00,,"STRUCTURE FOLD DES    7,   1333-1343 (1999)  ",1999,10574793,-0.27,0.25,2.86
Protherm,double,Tryptophan synthase alpha-subunit,Escherichia coli,268,28835.11,TSECA,TRPA_ECOLI (P0A877),P0A877,1WQ5,,,"P93A,H244A",A,25.00,7.80,NMR,Urea,,-4.80,,"BIOCHEMISTRY   35,     1988-1994 (1996) ",1996,8639683,-0.45,-0.14,3.13
Protherm,double,Protein G,Streptococcus,448,47656.04,A24496,SPG1_STRSP (P06654),P06654,1PGA,,,"I6T,T53V",A,25.00,5.20,CD,Thermal,,1.11,-17.29,"STRUCTURE FOLD DES    7,   1333-1343 (1999)  ",1999,10574793,2.02,0.08,0.68
Protherm,double,Gene V,Bacteriophage f1,87,9833.23,DDBPF1,G5P_BPFD (P69542),P69542,1VQB,,,"V35M,I47L",-,25.00,7.00,CD,GdnHCl,-0.80,-1.60,,"PROC NATL ACAD SCI U S A   88,     1706-1710 (1991) ",1991,2000379,-2.72,0.13,-1.16
Protherm,double,Ribonuclease T1,Aspergillus oryzae,125,13433.34,NRAST1,RNT1_ASPOR (P00651),P00651,1RN1,,,"W59Y,H92A",A,25.00,6.00,DSC,Thermal,,-1.53,-4.00,"EUR J BIOCHEM  220,    527-534 (1994) ",1994,8125111,-0.55,-0.11,1.10
Protherm,multiple,Tropomyosin,Rat,247,28822.16,I67850,TPM3_RAT (Q63610),Q63610,2TMA,,,"A74L,A78V,A81L",A,39.80,7.50,DSC,Thermal,,-0.85,2.70,"BIOCHEMISTRY   42,  14114-14121 (2003)  ",2003,14640678,-0.47,-0.17,6.05
Protherm,double,Protein G,Streptococcus,448,47683.11,A24496,SPG1_STRSP (P06654),P06654,1PGA,,,"I6K,T53E",A,25.00,7.20,CD,Thermal,,2.23,,"STRUCTURE FOLD DES    7,   1333-1343 (1999)  ",1999,10574793,1.62,0.78,0.98
Protherm,double,Ribonuclease A,Bovine,124,13821.31,NRBO,RNAS1_BOVIN (P61823),P61823,1RTB,,,"A4C,V118C",_,25.00,8.00,CD,GdnHCl,,1.12,,"BIOPHYS CHEM  141,     21-28 (2009)  ",2009,19155118,0.65,0.11,-2.45
Protherm,multiple,Staphylococcal nuclease,Staphylococcus aureus,231,25598.19,NCSAF,NUC_STAAU (P00644),P00644,1STN,,,"V23L,L25I,V66L",-,20.00,7.00,Fluorescence,GdnHCl,,-2.40,,BIOCHEMISTRY 40  14012-14019 (2001)     ,2001,11705393,-2.13,-0.28,0.79
Protherm,multiple,Lysozyme,Chicken,129,14397.03,LZCH,LYC_CHICK (P00698),P00698,4LYZ,,,"T89A,N93A,I98A",-,25.00,7.00,CD,Thermal,,-1.37,-7.90,"PROTEINS   40,     49-57 (2000) ",2000,10813830,-0.61,-0.15,2.51
Protherm,multiple,Staphylococcal nuclease,Staphylococcus aureus,231,25598.19,NCSAF,NUC_STAAU (P00644),P00644,1STN,,,"V66I,I72V,I92L",-,20.00,7.00,Fluorescence,GdnHCl,,-2.00,,BIOCHEMISTRY 40  14012-14019 (2001)     ,2001,11705393,-1.96,-0.14,0.31
Protherm,double,Protein G,Streptococcus,448,47702.11,A24496,SPG1_STRSP (P06654),P06654,1PGA,,,"I6F,T53Y",A,25.00,5.20,CD,Thermal,,1.70,-13.15,"STRUCTURE FOLD DES    7,   1333-1343 (1999)  ",1999,10574793,2.85,-0.08,1.58