DATABASE,MUT_TYPE,PROTEIN,SOURCE,LENGTH,MOL-WEIGHT,PIR_ID,SWISSPROT_ID,UNIPROT,PDB_wild,PDB_mutant,PDBs_template,MUTATION,MUTATED_CHAIN,TEMP,pH,MEASURE,METHOD,ddG_H2O,ddG,dTm,REFERENCE,YEAR,PMID
Protherm,multiple,Ribonuclease HI,Escherichia coli,155.00,17658.07,NRECH,RNH_ECOLI (P0A7Y4),P0A7Y4,2RN2,,,"H62P,T40A,K122R",-,52.70,5.50,CD,Thermal,,0.85,3.10,"J BIOL CHEM  269,   26904-26911 (1994) ",1994,7929430
Protherm,double,Ribonuclease HI,Escherichia coli,155.00,17695.19,NRECH,RNH_ECOLI (P0A7Y4),P0A7Y4,2RN2,,,"E119V,K60R",-,52.70,5.50,CD,Thermal,,0.63,2.30,"J BIOL CHEM  269,   26904-26911 (1994) ",1994,7929430
Protherm,double,Ribonuclease HI,Escherichia coli,155.00,17723.21,NRECH,RNH_ECOLI (P0A7Y4),P0A7Y4,2RN2,,,"E119V,R41C",-,52.70,5.50,CD,Thermal,,1.20,4.20,"J BIOL CHEM  269,   26904-26911 (1994) ",1994,7929430
Protherm,double,Ribonuclease HI,Escherichia coli,155.00,17710.20,NRECH,RNH_ECOLI (P0A7Y4),P0A7Y4,2RN2,,,"Q80L,K117R",-,50.10,3.00,CD,Thermal,,-0.03,-0.10,"J BIOL CHEM  269,   26904-26911 (1994) ",1994,7929430
Protherm,double,Ribonuclease HI,Escherichia coli,155.00,17695.19,NRECH,RNH_ECOLI (P0A7Y4),P0A7Y4,2RN2,,,"E119V,K60R",-,50.10,3.00,CD,Thermal,,-0.06,-0.20,"J BIOL CHEM  269,   26904-26911 (1994) ",1994,7929430
Protherm,double,Ribonuclease HI,Escherichia coli,155.00,17723.21,NRECH,RNH_ECOLI (P0A7Y4),P0A7Y4,2RN2,,,"E119V,R41C",-,50.10,3.00,CD,Thermal,,0.09,0.30,"J BIOL CHEM  269,   26904-26911 (1994) ",1994,7929430
Protherm,double,Lysozyme,Human,148.00,16608.08,LZHU,LYSC_HUMAN (P61626),P61626,1LZ1,1LHM,,"C77A,C95A",-,10.00,4.00,CD,GdnHCl,,-5.80,,"J BIOL CHEM  267,     4619-4624 (1992) ",1992,1537844
Protherm,double,Lysozyme,Human,148.00,16608.08,LZHU,LYSC_HUMAN (P61626),P61626,1LZ1,1LHM,,"C77A,C95A",-,10.00,3.00,Fluorescence,GdnHCl,,-5.70,,"J BIOL CHEM  267,     4619-4624 (1992) ",1992,1537844
Protherm,multiple,Arc repressor,Bacteriophage P22,53.00,6349.18,RGBPA2,RARC_BPP22 (P03050),P03050,1ARR,,,"F45L,R50G,I51S",A,25.00,7.50,CD,GdnHCl,-1.20,-1.20,-19.00,"PROC NATL ACAD SCI U S A   86,     2152-2156 (1989) ",1989,2928323
Protherm,double,Arc repressor,Bacteriophage P22,53.00,6426.22,RGBPA2,RARC_BPP22 (P03050),P03050,1ARR,,,"L12R,R13T",A,25.00,7.50,CD,GdnHCl,-1.80,-1.80,,"PROC NATL ACAD SCI U S A   86,     2152-2156 (1989) ",1989,2928323
Protherm,double,Gene V,Bacteriophage f1,87.00,9773.11,DDBPF1,G5P_BPFD (P69542),P69542,1VQB,,,"V35A,I47V",-,25.00,7.00,CD,GdnHCl,-2.70,-4.40,,"PROC NATL ACAD SCI U S A   88,     1706-1710 (1991) ",1991,2000379
Protherm,double,Gene V,Bacteriophage f1,87.00,9773.11,DDBPF1,G5P_BPFD (P69542),P69542,1VQB,1VQA,,"V35A,I47L",-,25.00,7.00,CD,GdnHCl,-1.10,-2.90,,"PROC NATL ACAD SCI U S A   88,     1706-1710 (1991) ",1991,2000379
Protherm,double,Gene V,Bacteriophage f1,87.00,9773.11,DDBPF1,G5P_BPFD (P69542),P69542,1VQB,,,"V35A,I47M",-,25.00,7.00,CD,GdnHCl,-3.40,-4.40,,"PROC NATL ACAD SCI U S A   88,     1706-1710 (1991) ",1991,2000379
Protherm,double,Gene V,Bacteriophage f1,87.00,9773.11,DDBPF1,G5P_BPFD (P69542),P69542,1VQB,,,"V35A,I47F",-,25.00,7.00,CD,GdnHCl,-2.10,-3.60,,"PROC NATL ACAD SCI U S A   88,     1706-1710 (1991) ",1991,2000379
Protherm,double,Gene V,Bacteriophage f1,87.00,9815.19,DDBPF1,G5P_BPFD (P69542),P69542,1VQB,,,"V35L,I47V",-,25.00,7.00,CD,GdnHCl,-4.00,-5.00,,"PROC NATL ACAD SCI U S A   88,     1706-1710 (1991) ",1991,2000379
Protherm,double,Gene V,Bacteriophage f1,87.00,9815.19,DDBPF1,G5P_BPFD (P69542),P69542,1VQB,,,"V35L,I47L",-,25.00,7.00,CD,GdnHCl,-2.20,-3.50,,"PROC NATL ACAD SCI U S A   88,     1706-1710 (1991) ",1991,2000379
Protherm,double,Gene V,Bacteriophage f1,87.00,9815.19,DDBPF1,G5P_BPFD (P69542),P69542,1VQB,,,"V35L,I47F",-,25.00,7.00,CD,GdnHCl,-2.60,-3.94,,"PROC NATL ACAD SCI U S A   88,     1706-1710 (1991) ",1991,2000379
Protherm,double,Gene V,Bacteriophage f1,87.00,9815.19,DDBPF1,G5P_BPFD (P69542),P69542,1VQB,1VQF,,"V35I,I47V",-,25.00,7.00,CD,GdnHCl,-2.10,-3.00,,"PROC NATL ACAD SCI U S A   88,     1706-1710 (1991) ",1991,2000379
Protherm,double,Gene V,Bacteriophage f1,87.00,9815.19,DDBPF1,G5P_BPFD (P69542),P69542,1VQB,1VQD,,"V35I,I47L",-,25.00,7.00,CD,GdnHCl,-0.10,-1.10,,"PROC NATL ACAD SCI U S A   88,     1706-1710 (1991) ",1991,2000379
Protherm,double,Gene V,Bacteriophage f1,87.00,9815.19,DDBPF1,G5P_BPFD (P69542),P69542,1VQB,1VQE,,"V35I,I47M",-,25.00,7.00,CD,GdnHCl,-1.60,-2.80,,"PROC NATL ACAD SCI U S A   88,     1706-1710 (1991) ",1991,2000379
Protherm,double,Gene V,Bacteriophage f1,87.00,9815.19,DDBPF1,G5P_BPFD (P69542),P69542,1VQB,1VQC,,"V35I,I47F",-,25.00,7.00,CD,GdnHCl,-0.50,-2.00,,"PROC NATL ACAD SCI U S A   88,     1706-1710 (1991) ",1991,2000379
Protherm,double,Gene V,Bacteriophage f1,87.00,9833.23,DDBPF1,G5P_BPFD (P69542),P69542,1VQB,,,"V35M,I47F",-,25.00,7.00,CD,GdnHCl,-0.20,-2.30,,"PROC NATL ACAD SCI U S A   88,     1706-1710 (1991) ",1991,2000379
Protherm,double,Gene V,Bacteriophage f1,87.00,9849.20,DDBPF1,G5P_BPFD (P69542),P69542,1VQB,,,"V35F,I47L",-,25.00,7.00,CD,GdnHCl,-3.60,-4.10,,"PROC NATL ACAD SCI U S A   88,     1706-1710 (1991) ",1991,2000379
Protherm,double,Lysozyme,Bacteriophage T4,164.00,18740.09,LZBPT4,LYS_BPT4 (P00720),P00720,2LZM,,,"L99A,F153A",-,51.80,3.01,CD,Thermal,,-8.30,-41.80,"SCIENCE  255,       178-183 (1992) ",1992,1553543
Protherm,double,Lysozyme,Bacteriophage T4,164.00,18705.14,LZBPT4,LYS_BPT4 (P00720),P00720,2LZM,,,"E45A,K48A",-,51.65,3.00,CD,Thermal,,0.38,1.04,"PROC NATL ACAD SCI U S A   89,     3751-3755 (1992) ",1992,1570293
Protherm,double,Lysozyme,Bacteriophage T4,164.00,18705.14,LZBPT4,LYS_BPT4 (P00720),P00720,2LZM,,,"E45A,K48A",-,62.20,6.70,CD,Thermal,,0.01,0.03,"PROC NATL ACAD SCI U S A   89,     3751-3755 (1992) ",1992,1570293
Protherm,double,Lysozyme,Bacteriophage T4,164.00,18763.17,LZBPT4,LYS_BPT4 (P00720),P00720,2LZM,,,"R80K,R119H",-,65.15,5.40,CD,Thermal,,-0.47,-1.20,"PROTEIN SCI       2,     2217-2225 (1993) ",1993,7507755
Protherm,double,Lysozyme,Bacteriophage T4,164.00,18664.00,LZBPT4,LYS_BPT4 (P00720),P00720,2LZM,,,"L121A,A129L",-,65.30,5.40,CD,Thermal,,-1.10,-2.80,"J MOL BIOL  259,       542-559 (1996) ",1996,8676387
Protherm,double,Lysozyme,Bacteriophage T4,164.00,18664.00,LZBPT4,LYS_BPT4 (P00720),P00720,2LZM,,,"L121A,A129M",-,65.30,5.40,CD,Thermal,,-1.00,-2.70,"J MOL BIOL  259,       542-559 (1996) ",1996,8676387
Protherm,double,Lysozyme,Bacteriophage T4,164.00,18842.29,LZBPT4,LYS_BPT4 (P00720),P00720,2LZM,,,"A129M,F153A",-,65.30,5.40,CD,Thermal,,-4.30,-12.70,"J MOL BIOL  259,       542-559 (1996) ",1996,8676387
Protherm,double,Lysozyme,Bacteriophage T4,164.00,18692.06,LZBPT4,LYS_BPT4 (P00720),P00720,2LZM,,,"T115A,S117A",-,51.65,3.01,CD,Thermal,,0.95,2.84,"J MOL BIOL  246,       317-330 (1995) ",1995,7869383
Protherm,double,Lysozyme,Bacteriophage T4,164.00,18703.01,LZBPT4,LYS_BPT4 (P00720),P00720,2LZM,,,"M120A,Q122A",-,51.65,3.01,CD,Thermal,,-0.25,-0.75,"J MOL BIOL  246,       317-330 (1995) ",1995,7869383
Protherm,double,Lysozyme,Bacteriophage T4,164.00,18723.18,LZBPT4,LYS_BPT4 (P00720),P00720,2LZM,,,"N116A,M120A",-,51.65,3.01,CD,Thermal,,0.21,0.58,"J MOL BIOL  246,       317-330 (1995) ",1995,7869383
Protherm,double,Lysozyme,Bacteriophage T4,164.00,18678.02,LZBPT4,LYS_BPT4 (P00720),P00720,2LZM,,,"R119A,Q123A",-,51.65,3.01,CD,Thermal,,-0.17,-0.51,"J MOL BIOL  246,       317-330 (1995) ",1995,7869383
Protherm,double,Lysozyme,Bacteriophage T4,164.00,18768.14,LZBPT4,LYS_BPT4 (P00720),P00720,2LZM,,,"L99F,V111I",-,51.76,3.01,CD,Thermal,,-0.82,-2.70,"J MOL BIOL  224,     1143-1159 (1992) ",1992,1569571
Protherm,double,Lysozyme,Bacteriophage T4,164.00,18816.18,LZBPT4,LYS_BPT4 (P00720),P00720,2LZM,,,"L99F,F153L",-,51.76,3.01,CD,Thermal,,0.03,0.09,"J MOL BIOL  224,     1143-1159 (1992) ",1992,1569571
Protherm,double,Lysozyme,Bacteriophage T4,164.00,18716.09,LZBPT4,LYS_BPT4 (P00720),P00720,2LZM,,,"M102L,V111F",-,51.76,3.01,CD,Thermal,,-1.51,-5.49,"J MOL BIOL  224,     1143-1159 (1992) ",1992,1569571
Protherm,multiple,Lysozyme,Bacteriophage T4,164.00,18800.21,LZBPT4,LYS_BPT4 (P00720),P00720,2LZM,,,"L99F,M102L,V111I",-,51.76,3.01,CD,Thermal,,-1.15,-4.02,"J MOL BIOL  224,     1143-1159 (1992) ",1992,1569571
Protherm,multiple,Lysozyme,Bacteriophage T4,164.00,18768.14,LZBPT4,LYS_BPT4 (P00720),P00720,2LZM,,,"L99F,V111I,F153L",-,51.76,3.01,CD,Thermal,,-0.55,-1.73,"J MOL BIOL  224,     1143-1159 (1992) ",1992,1569571
Protherm,double,Lysozyme,Bacteriophage T4,164.00,18800.21,LZBPT4,LYS_BPT4 (P00720),P00720,2LZM,,,"L99F,M102L",-,64.89,5.70,CD,Thermal,,-0.75,-2.21,"J MOL BIOL  224,     1143-1159 (1992) ",1992,1569571
Protherm,double,Lysozyme,Bacteriophage T4,164.00,18768.14,LZBPT4,LYS_BPT4 (P00720),P00720,2LZM,,,"L99F,V111I",-,64.89,5.70,CD,Thermal,,-0.93,-2.51,"J MOL BIOL  224,     1143-1159 (1992) ",1992,1569571
Protherm,double,Lysozyme,Bacteriophage T4,164.00,18816.18,LZBPT4,LYS_BPT4 (P00720),P00720,2LZM,,,"L99F,F153L",-,64.89,5.70,CD,Thermal,,0.21,0.58,"J MOL BIOL  224,     1143-1159 (1992) ",1992,1569571
Protherm,double,Lysozyme,Bacteriophage T4,164.00,18716.09,LZBPT4,LYS_BPT4 (P00720),P00720,2LZM,,,"M102L,V111F",-,64.89,5.70,CD,Thermal,,-2.11,-6.19,"J MOL BIOL  224,     1143-1159 (1992) ",1992,1569571
Protherm,double,Lysozyme,Bacteriophage T4,164.00,18796.20,LZBPT4,LYS_BPT4 (P00720),P00720,2LZM,,,"V111I,F153L",-,64.89,5.70,CD,Thermal,,-1.09,-3.24,"J MOL BIOL  224,     1143-1159 (1992) ",1992,1569571
Protherm,multiple,Lysozyme,Bacteriophage T4,164.00,18800.21,LZBPT4,LYS_BPT4 (P00720),P00720,2LZM,,,"L99F,M102L,V111I",-,64.89,5.70,CD,Thermal,,-1.20,-3.83,"J MOL BIOL  224,     1143-1159 (1992) ",1992,1569571
Protherm,multiple,Lysozyme,Bacteriophage T4,164.00,18800.21,LZBPT4,LYS_BPT4 (P00720),P00720,2LZM,,,"L99F,M102L,F153L",-,64.89,5.70,CD,Thermal,,-0.22,-0.74,"J MOL BIOL  224,     1143-1159 (1992) ",1992,1569571
Protherm,multiple,Lysozyme,Bacteriophage T4,164.00,18768.14,LZBPT4,LYS_BPT4 (P00720),P00720,2LZM,,,"L99F,V111I,F153L",-,64.89,5.70,CD,Thermal,,-0.43,-1.25,"J MOL BIOL  224,     1143-1159 (1992) ",1992,1569571
Protherm,multiple,Lysozyme,Bacteriophage T4,164.00,18798.17,LZBPT4,LYS_BPT4 (P00720),P00720,2LZM,,,"W138Y,W126Y,W158Y",-,36.85,2.00,CD,Thermal,,-3.00,-7.00,"BIOPOLYMERS   20,     1989-1999 (1981) ",1981,7306671
Protherm,double,Lysozyme,Bacteriophage T4,164.00,18720.10,LZBPT4,LYS_BPT4 (P00720),P00720,2LZM,1L72,,"D127A,E128A",-,40.75,2.02,CD,Thermal,,0.24,0.90,"PROTEIN SCI       1,       761-776 (1992) ",1992,1304917
Protherm,double,Lysozyme,Bacteriophage T4,164.00,18676.10,LZBPT4,LYS_BPT4 (P00720),P00720,2LZM,1L71,,"E128A,V131A",-,40.75,2.02,CD,Thermal,,0.44,1.50,"PROTEIN SCI       1,       761-776 (1992) ",1992,1304917
Protherm,double,Lysozyme,Bacteriophage T4,164.00,18721.05,LZBPT4,LYS_BPT4 (P00720),P00720,2LZM,1L70,,"V131A,N132A",-,40.75,2.02,CD,Thermal,,0.57,2.30,"PROTEIN SCI       1,       761-776 (1992) ",1992,1304917
Protherm,multiple,Lysozyme,Bacteriophage T4,164.00,18676.10,LZBPT4,LYS_BPT4 (P00720),P00720,2LZM,1L36,,"E128A,V131A,N132A",-,40.75,2.02,CD,Thermal,,0.91,3.40,"PROTEIN SCI       1,       761-776 (1992) ",1992,1304917
Protherm,double,Lysozyme,Bacteriophage T4,164.00,18734.13,LZBPT4,LYS_BPT4 (P00720),P00720,2LZM,,,"C54V,C97S",-,70.00,6.50,CD,Thermal,,-2.10,-6.00,"PROC NATL ACAD SCI U S A   85,       401-405 (1988) ",1988,3277175
Protherm,double,Lysozyme,Bacteriophage T4,164.00,18736.10,LZBPT4,LYS_BPT4 (P00720),P00720,2LZM,1L63,,"C54T,C97A",-,38.80,2.00,DSC,Thermal,,-0.34,,"BIOCHEMISTRY   31,     1643-1647 (1992) ",1992,1737020
Protherm,double,Lysozyme,Bacteriophage T4,164.00,18736.10,LZBPT4,LYS_BPT4 (P00720),P00720,2LZM,1L63,,"C54T,C97A",-,46.20,2.50,DSC,Thermal,,-0.77,,"BIOCHEMISTRY   31,     1643-1647 (1992) ",1992,1737020
Protherm,double,Lysozyme,Bacteriophage T4,164.00,18736.10,LZBPT4,LYS_BPT4 (P00720),P00720,2LZM,1L63,,"C54T,C97A",-,53.60,3.00,DSC,Thermal,,-1.27,,"BIOCHEMISTRY   31,     1643-1647 (1992) ",1992,1737020
Protherm,double,Lysozyme,Bacteriophage T4,164.00,18775.18,LZBPT4,LYS_BPT4 (P00720),P00720,2LZM,,,"S117I,N132M",-,66.48,5.40,CD,Thermal,,2.00,5.50,"PROC NATL ACAD SCI U S A   92,       452-456 (1995) ",1995,7831309
Protherm,double,Lysozyme,Bacteriophage T4,164.00,18775.18,LZBPT4,LYS_BPT4 (P00720),P00720,2LZM,,,"S117I,N132I",-,66.48,5.40,CD,Thermal,,1.40,3.60,"PROC NATL ACAD SCI U S A   92,       452-456 (1995) ",1995,7831309
Protherm,double,Lysozyme,Bacteriophage T4,164.00,18733.10,LZBPT4,LYS_BPT4 (P00720),P00720,2LZM,,,"S117A,N132I",-,65.10,5.40,CD,Thermal,,2.00,5.30,"PROC NATL ACAD SCI U S A   92,       452-456 (1995) ",1995,7831309
Protherm,double,Lysozyme,Bacteriophage T4,164.00,18733.10,LZBPT4,LYS_BPT4 (P00720),P00720,2LZM,,,"S117A,N132M",-,65.10,5.40,CD,Thermal,,1.80,4.70,"PROC NATL ACAD SCI U S A   92,       452-456 (1995) ",1995,7831309
Protherm,double,Lysozyme,Bacteriophage T4,164.00,18764.15,LZBPT4,LYS_BPT4 (P00720),P00720,2LZM,1L49,,"A98V,T152S",-,40.00,3.00,CD,Thermal,,-4.80,-13.90,"J MOL BIOL  221,       647-667 (1991) ",1991,1920439
Protherm,multiple,Lysozyme,Bacteriophage T4,164.00,18762.18,LZBPT4,LYS_BPT4 (P00720),P00720,2LZM,1L50,,"A98V,V149C,T152S",-,40.00,3.00,CD,Thermal,,-4.40,-12.10,"J MOL BIOL  221,       647-667 (1991) ",1991,1920439
Protherm,multiple,Lysozyme,Bacteriophage T4,164.00,18762.18,LZBPT4,LYS_BPT4 (P00720),P00720,2LZM,1L51,,"A98V,V149I,T152S",-,40.00,3.00,CD,Thermal,,-4.40,-12.00,"J MOL BIOL  221,       647-667 (1991) ",1991,1920439
Protherm,double,Lysozyme,Bacteriophage T4,164.00,18762.18,LZBPT4,LYS_BPT4 (P00720),P00720,2LZM,,,"A41V,V131A",-,51.10,2.83,CD,Thermal,,0.60,1.81,"PROTEINS       7,       198-204 (1990) ",1990,2326253
Protherm,double,Barnase,Bacillus amyloliquefaciens,123.00,13911.14,NRBSN,RNBR_BACAM (P00648),P00648,1BNI,,,"H18A,W94L",A,25.00,6.30,Fluorescence,Urea,-2.30,-2.36,,"J MOL BIOL  227,       544-559 (1992) ",1992,1404368
Protherm,double,Barnase,Bacillus amyloliquefaciens,123.00,13927.14,NRBSN,RNBR_BACAM (P00648),P00648,1BNI,,,"H18S,W94L",A,25.00,6.30,Fluorescence,Urea,-2.80,-2.59,,"J MOL BIOL  227,       544-559 (1992) ",1992,1404368
Protherm,double,Barnase,Bacillus amyloliquefaciens,123.00,13954.16,NRBSN,RNBR_BACAM (P00648),P00648,1BNI,,,"H18N,W94L",A,25.00,6.30,Fluorescence,Urea,-1.70,-1.77,,"J MOL BIOL  227,       544-559 (1992) ",1992,1404368
Protherm,double,Barnase,Bacillus amyloliquefaciens,123.00,13968.23,NRBSN,RNBR_BACAM (P00648),P00648,1BNI,,,"H18K,W94L",A,25.00,6.30,Fluorescence,Urea,-2.70,-2.34,,"J MOL BIOL  227,       544-559 (1992) ",1992,1404368
Protherm,double,Lysozyme,Chicken,129.00,14386.01,LZCH,LYC_CHICK (P00698),P00698,4LYZ,1HEQ,,"T40S,S91T",-,74.00,6.40,CD,Thermal,,0.61,1.60,"PROTEIN SCI       4,     2050-2062 (1995) ",1995,8535241
Protherm,double,Lysozyme,Chicken,129.00,14386.00,LZCH,LYC_CHICK (P00698),P00698,4LYZ,1HEN,,"I55V,S91T",-,74.00,6.40,CD,Thermal,,0.00,0.00,"PROTEIN SCI       4,     2050-2062 (1995) ",1995,8535241
Protherm,multiple,Lysozyme,Chicken,129.00,14412.09,LZCH,LYC_CHICK (P00698),P00698,4LYZ,1HEP,,"T40S,I55V,S91T",-,74.00,6.40,CD,Thermal,,-0.30,-0.80,"PROTEIN SCI       4,     2050-2062 (1995) ",1995,8535241
Protherm,double,Lysozyme,Chicken,129.00,14386.01,LZCH,LYC_CHICK (P00698),P00698,4LYZ,,,"T40S,S91V",-,74.00,6.40,CD,Thermal,,-0.53,-1.40,"PROTEIN SCI       4,     2050-2062 (1995) ",1995,8535241
Protherm,double,Lysozyme,Chicken,129.00,14386.01,LZCH,LYC_CHICK (P00698),P00698,4LYZ,,,"T40S,S91A",-,74.00,6.40,CD,Thermal,,-0.87,-2.30,"PROTEIN SCI       4,     2050-2062 (1995) ",1995,8535241
Protherm,double,Lysozyme,Chicken,129.00,14386.00,LZCH,LYC_CHICK (P00698),P00698,4LYZ,,,"I55V,S91V",-,74.00,6.40,CD,Thermal,,-1.25,-3.30,"PROTEIN SCI       4,     2050-2062 (1995) ",1995,8535241
Protherm,double,Lysozyme,Chicken,129.00,14412.09,LZCH,LYC_CHICK (P00698),P00698,4LYZ,,,"T40S,I55V",-,74.00,6.40,CD,Thermal,,-1.33,-3.50,"PROTEIN SCI       4,     2050-2062 (1995) ",1995,8535241
Protherm,multiple,Lysozyme,Chicken,129.00,14412.09,LZCH,LYC_CHICK (P00698),P00698,4LYZ,,,"T40S,I55V,S91A",-,74.00,6.40,CD,Thermal,,-1.67,-4.40,"PROTEIN SCI       4,     2050-2062 (1995) ",1995,8535241
Protherm,double,Lysozyme,Chicken,129.00,14357.95,LZCH,LYC_CHICK (P00698),P00698,4LYZ,,,"I55A,S91T",-,74.00,6.40,CD,Thermal,,-2.77,-7.30,"PROTEIN SCI       4,     2050-2062 (1995) ",1995,8535241
Protherm,double,Chymotrypsin inhibitor,Barley,84.00,9452.08,EIBH2A,ICI2_HORVU (P01053),P01053,2CI2,,,"I48A,I76V",I,25.00,6.30,Fluorescence,GdnHCl,-4.08,-4.17,,"BIOCHEMISTRY   32,   11259-11269 (1993) ",1993,8218191
Protherm,double,Chymotrypsin inhibitor,Barley,84.00,9452.08,EIBH2A,ICI2_HORVU (P01053),P01053,2CI2,,,"I48A,I76V",I,25.00,3.50,DSC,Thermal,,-4.69,,"BIOCHEMISTRY   32,   11259-11269 (1993) ",1993,8218191
Protherm,double,Chymotrypsin inhibitor,Barley,84.00,9480.09,EIBH2A,ICI2_HORVU (P01053),P01053,2CI2,,,"T58A,E60A",I,25.00,6.30,Fluorescence,GdnHCl,-0.67,-0.87,,"BIOCHEMISTRY   33,   13880-13887 (1994) ",1994,7947796
Protherm,double,Chymotrypsin inhibitor,Barley,84.00,9524.10,EIBH2A,ICI2_HORVU (P01053),P01053,2CI2,,,"T58D,E60A",I,25.00,6.30,Fluorescence,GdnHCl,-0.24,-0.25,,"BIOCHEMISTRY   33,   13880-13887 (1994) ",1994,7947796
Protherm,double,Chymotrypsin inhibitor,Barley,84.00,9453.02,EIBH2A,ICI2_HORVU (P01053),P01053,2CI2,,,"K21A,E26A",I,25.00,6.25,Fluorescence,GdnHCl,-1.17,-1.10,,"J MOL BIOL  254,       260-288 (1995) ",1995,7490748
Protherm,double,Chymotrypsin inhibitor,Barley,84.00,9426.05,EIBH2A,ICI2_HORVU (P01053),P01053,2CI2,,,"P25A,A35G",I,25.00,6.25,Fluorescence,GdnHCl,-1.30,-2.65,,"J MOL BIOL  254,       260-288 (1995) ",1995,7490748
Protherm,multiple,Chymotrypsin inhibitor,Barley,84.00,9480.08,EIBH2A,ICI2_HORVU (P01053),P01053,2CI2,1YPB,,"S31G,E33A,E34A",I,25.00,6.25,Fluorescence,GdnHCl,-0.81,-1.63,,"J MOL BIOL  254,       260-288 (1995) ",1995,7490748
Protherm,double,Chymotrypsin inhibitor,Barley,84.00,9515.27,EIBH2A,ICI2_HORVU (P01053),P01053,2CI2,,,"Q47M,M59L",I,25.00,6.25,Fluorescence,GdnHCl,-0.18,0.32,,"J MOL BIOL  254,       260-288 (1995) ",1995,7490748
Protherm,double,Chymotrypsin inhibitor,Barley,84.00,9514.14,EIBH2A,ICI2_HORVU (P01053),P01053,2CI2,,,"L51V,F69A",I,25.00,6.25,Fluorescence,GdnHCl,-3.26,-3.41,,"J MOL BIOL  254,       260-288 (1995) ",1995,7490748
Protherm,double,Chymotrypsin inhibitor,Barley,84.00,9486.09,EIBH2A,ICI2_HORVU (P01053),P01053,2CI2,,,"L51A,F69L",I,25.00,6.25,Fluorescence,GdnHCl,-3.25,-3.42,,"J MOL BIOL  254,       260-288 (1995) ",1995,7490748
Protherm,double,Chymotrypsin inhibitor,Barley,84.00,9486.09,EIBH2A,ICI2_HORVU (P01053),P01053,2CI2,,,"L51A,F69A",I,25.00,6.25,Fluorescence,GdnHCl,-5.16,-4.79,,"J MOL BIOL  254,       260-288 (1995) ",1995,7490748
Protherm,double,Chymotrypsin inhibitor,Barley,84.00,9438.05,EIBH2A,ICI2_HORVU (P01053),P01053,2CI2,,,"L51A,V57A",I,25.00,6.25,Fluorescence,GdnHCl,-2.95,-3.16,,"J MOL BIOL  254,       260-288 (1995) ",1995,7490748
Protherm,double,Chymotrypsin inhibitor,Barley,84.00,9466.10,EIBH2A,ICI2_HORVU (P01053),P01053,2CI2,,,"L51V,V57A",I,25.00,6.25,Fluorescence,GdnHCl,-1.93,-1.85,,"J MOL BIOL  254,       260-288 (1995) ",1995,7490748
Protherm,multiple,Chymotrypsin inhibitor,Barley,84.00,9438.05,EIBH2A,ICI2_HORVU (P01053),P01053,2CI2,,,"L51A,V57A,F69L",I,25.00,6.25,Fluorescence,GdnHCl,-3.34,-3.48,,"J MOL BIOL  254,       260-288 (1995) ",1995,7490748
Protherm,multiple,Chymotrypsin inhibitor,Barley,84.00,9466.10,EIBH2A,ICI2_HORVU (P01053),P01053,2CI2,,,"L51V,V57A,F69L",I,25.00,6.25,Fluorescence,GdnHCl,-2.84,-2.72,,"J MOL BIOL  254,       260-288 (1995) ",1995,7490748
Protherm,double,Chymotrypsin inhibitor,Barley,84.00,9500.12,EIBH2A,ICI2_HORVU (P01053),P01053,2CI2,,,"V57A,F69L",I,25.00,6.25,Fluorescence,GdnHCl,-2.20,-2.58,,"J MOL BIOL  254,       260-288 (1995) ",1995,7490748
Protherm,double,Chymotrypsin inhibitor,Barley,84.00,9410.98,EIBH2A,ICI2_HORVU (P01053),P01053,2CI2,,,"R62A,D64A",I,25.00,6.25,Fluorescence,GdnHCl,-2.46,-1.22,,"J MOL BIOL  254,       260-288 (1995) ",1995,7490748
Protherm,double,Chemotactic protein,Escherichia coli,129.00,14230.14,QRECCY,CHEY_ECOLI (P0AE67),P0AE67,1CEY,,,"A36G,F14N",-,25.00,8.00,CD,Urea,,-0.20,,"PROTEINS   22,       340-349 (1995) ",1995,7479708
Protherm,double,Chemotactic protein,Escherichia coli,129.00,14200.16,QRECCY,CHEY_ECOLI (P0AE67),P0AE67,1CEY,,,"D38A,F14N",-,25.00,8.00,CD,Urea,,1.00,,"PROTEINS   22,       340-349 (1995) ",1995,7479708
Protherm,double,Chemotactic protein,Escherichia coli,129.00,14186.13,QRECCY,CHEY_ECOLI (P0AE67),P0AE67,1CEY,,,"D38G,F14N",-,25.00,8.00,CD,Urea,,1.90,,"PROTEINS   22,       340-349 (1995) ",1995,7479708
Protherm,double,Chemotactic protein,Escherichia coli,129.00,14230.14,QRECCY,CHEY_ECOLI (P0AE67),P0AE67,1CEY,,,"A42G,F14N",-,25.00,8.00,CD,Urea,,0.60,,"PROTEINS   22,       340-349 (1995) ",1995,7479708
Protherm,double,Chemotactic protein,Escherichia coli,129.00,14200.16,QRECCY,CHEY_ECOLI (P0AE67),P0AE67,1CEY,,,"D64A,F14N",-,25.00,8.00,CD,Urea,,1.70,,"PROTEINS   22,       340-349 (1995) ",1995,7479708
Protherm,double,Chemotactic protein,Escherichia coli,129.00,14186.13,QRECCY,CHEY_ECOLI (P0AE67),P0AE67,1CEY,,,"D64G,F14N",-,25.00,8.00,CD,Urea,,2.60,,"PROTEINS   22,       340-349 (1995) ",1995,7479708
Protherm,double,Chemotactic protein,Escherichia coli,129.00,14187.08,QRECCY,CHEY_ECOLI (P0AE67),P0AE67,1CEY,,,"K91A,F14N",-,25.00,8.00,CD,Urea,,3.30,,"PROTEINS   22,       340-349 (1995) ",1995,7479708
Protherm,double,Chemotactic protein,Escherichia coli,129.00,14173.05,QRECCY,CHEY_ECOLI (P0AE67),P0AE67,1CEY,,,"K91G,F14N",-,25.00,8.00,CD,Urea,,3.40,,"PROTEINS   22,       340-349 (1995) ",1995,7479708
Protherm,double,Chemotactic protein,Escherichia coli,129.00,14230.14,QRECCY,CHEY_ECOLI (P0AE67),P0AE67,1CEY,,,"A98G,F14N",-,25.00,8.00,CD,Urea,,1.60,,"PROTEINS   22,       340-349 (1995) ",1995,7479708
Protherm,double,Chemotactic protein,Escherichia coli,129.00,14230.14,QRECCY,CHEY_ECOLI (P0AE67),P0AE67,1CEY,,,"A103G,F14N",-,25.00,8.00,CD,Urea,,1.20,,"PROTEINS   22,       340-349 (1995) ",1995,7479708
Protherm,double,Chemotactic protein,Escherichia coli,129.00,14200.12,QRECCY,CHEY_ECOLI (P0AE67),P0AE67,1CEY,,,"T112G,F14N",-,25.00,8.00,CD,Urea,,1.90,,"PROTEINS   22,       340-349 (1995) ",1995,7479708
Protherm,double,Dihydrofolate reductase,Escherichia coli,159.00,18053.08,RDECD,DYR_ECOLI (P0ABQ4),P0ABQ4,1RX4,,,"R44L,P66A",_,15.00,7.80,Abs,Urea,0.90,0.90,,"BIOCHEMISTRY   31,     5687-5691 (1992) ",1992,1610817
Protherm,double,Lysozyme,Human,148.00,16594.05,LZHU,LYSC_HUMAN (P61626),P61626,1LZ1,,,"P71G,P103G",-,68.80,2.80,DSC,Thermal,,-1.60,-4.50,"BIOCHEMISTRY   31,     7077-7085 (1992) ",1992,1643041
Protherm,double,Ribonuclease A,Bovine,124.00,13761.20,NRBO,RNAS1_BOVIN (P61823),P61823,1RTB,,,"P93A,P114G",-,56.05,4.20,CD,Thermal,,-4.20,-20.00,"PROTEIN SCI       1,       910-916 (1992) ",1992,1338975
Protherm,double,Barnase,Bacillus amyloliquefaciens,123.00,13846.12,NRBSN,RNBR_BACAM (P00648),P00648,1BNI,,,"D8A,V10A",A,25.00,6.30,Fluorescence,Urea,-1.13,-0.42,,"J MOL BIOL  224,       783-804 (1992) ",1992,1569557
Protherm,multiple,Barnase,Bacillus amyloliquefaciens,123.00,13862.08,NRBSN,RNBR_BACAM (P00648),P00648,1BNI,,,"D8A,D12A,R110A",A,25.00,6.30,Fluorescence,Urea,-0.18,0.10,,"J MOL BIOL  224,       783-804 (1992) ",1992,1569557
Protherm,double,Barnase,Bacillus amyloliquefaciens,123.00,13800.01,NRBSN,RNBR_BACAM (P00648),P00648,1BNI,,,"Y17A,T16A",A,25.00,6.30,Fluorescence,Urea,-1.92,-2.15,,"J MOL BIOL  224,       783-804 (1992) ",1992,1569557
Protherm,double,Staphylococcal nuclease,Staphylococcus aureus,231.00,25542.08,NCSAF,NUC_STAAU (P00644),P00644,1STN,,,"V66L,G88V",-,51.40,7.00,DSC,Thermal,,1.00,6.40,"PROTEIN SCI       2,       567-576 (1993) ",1993,8518730
Protherm,double,Staphylococcal nuclease,Staphylococcus aureus,231.00,25542.08,NCSAF,NUC_STAAU (P00644),P00644,1STN,,,"V66L,G88V",-,47.00,5.00,DSC,Thermal,,1.20,10.90,"PROTEIN SCI       2,       567-576 (1993) ",1993,8518730
Protherm,multiple,Staphylococcal nuclease,Staphylococcus aureus,231.00,25542.08,NCSAF,NUC_STAAU (P00644),P00644,1STN,,,"V66L,G79S,G88V",-,47.00,5.00,DSC,Thermal,,0.50,7.30,"PROTEIN SCI       2,       567-576 (1993) ",1993,8518730